{"text_format":"3","workbook":"xlsx","n_sheets":8,"sheets":["基表第一版","基表第二版","基表第三版","2021年度大型仪器设备开放共享评价考核统计表","Worksheet","Worksheet (2)","Sheet2","Sheet3"],"not_rendered":{"external_links":1,"defined_names":5},"read":"whole","date_system":"1900"}

{"sheet":"基表第一版","index":0,"n_rows":360,"n_cols":30,"rows_kept":360,"hidden":true}
["资产编号","资产分类","资产名称","规格型号","价值（万元）","建账日期","使用部门","生产厂家","套件数","使用人工号","使用人姓名","使用方向","使用管理部门编号","使用管理部门名称（二级）","现状","资产状态","规格","经费来源","购置日期","出厂日期","国别","科技部备注","是否纳入信息系统","不能纳入系统原因","是否提供系统共享","不能提供系统共享原因","是否上报科技部","不上报科技部原因","是否科技部共享","科技部不共享原因"]
["2015015504","其他排灌设备","指针式喷灌机","DYP-8120",50,"2015-03-24","水利与建筑工程学院","维蒙特工业（山东）有限公司",1,2008118418,"朱德兰","科研","00804","水利与建筑工程学院 水利水电工程系","在用","正常","*","科研专款及基金","2015-03-19 00:00:00","2014-10-27 00:00:00","中国",{"$f":"VLOOKUP(A2,Sheet2!A:I,9,)","v":"不纳入科研仪器范畴：辅助设备"},"否","不纳入系统(生产设备)","--",null,"否","不纳入科研仪器范畴：辅助设备","否"]
["2015856004","喷灌机械设备","新型薄壁滴灌带生产线","自制研发",50,"2015-12-08","水土保持研究所","莱芜市银鹰滴灌技术开发中心",1,2008116173,"牛文全","科研","02110","水土保持研究所 国家节水灌溉杨凌工程技术研究中心","在用","正常","*","科研专款及基金","2015-10-11 00:00:00","2015-10-11 00:00:00","中国",{"$f":"VLOOKUP(A3,Sheet2!A:I,9,)","v":"不纳入科研仪器范畴：辅助设备"},"是","不纳入系统(生产设备)","是",null,"否","不纳入科研仪器范畴：辅助设备","否"]
["2019341803","其他分析仪器","酶标仪（多功能微孔板检测仪）","SPARK",50,"2019-11-27","农学院","Tecan Group Ltd.",1,2013110058,"徐淑兔","科研",2141604,"农学院 农学系","在用","正常","SPARK","基建设备费","2019-09-17 00:00:00","2019-06-27 00:00:00","奥地利",{"$f":"VLOOKUP(A4,Sheet2!A:I,9,)","v":0},"是",null,"是",null,"是",null,"是"]
["2015227603","其他分析仪器","多功能酶标仪","SynergyH1",50.05,"2015-11-11","动物科技学院","BioTek公司",1,2008116839,"王立强","教学","0040502","动物科技学院 动物科学实验室","在用","正常","*","教育事业费","2015-05-11 00:00:00","2015-01-10 00:00:00","美国",{"$f":"VLOOKUP(A5,Sheet2!A:I,9,)","v":0},"是",null,"是",null,"是",null,"是"]
["2021049003","物理特性分析仪器及校准仪器","快速粘度分析仪","RVA-Tec Master",50.11,"2021-05-10","食品科学与工程学院","瑞典波通仪器公司",1,2017120020,"马翠翠","教学","0110801","食品科学与工程学院 食品工艺实验室","在用","正常","RVA-Tec Master","教育事业费","2019-12-09 00:00:00","2019-06-27 00:00:00","澳大利亚",{"$f":"VLOOKUP(A6,Sheet2!A:I,9,)","v":{"$error":"#N/A"}},"是",null,"是",null,"是",null,"是"]
["2020403303","物理光学仪器","傅里叶变换红外光谱仪","Nicolet is50",50.3,"2020-11-12","水土保持研究所","美国赛默飞世尔科技有限公司",1,2008117329,"徐宣斌","科研","02106","水土保持研究所 黄土高原土壤侵蚀与旱地农业国家重点实验室","在用","正常","Nicolet is","科研专款及基金","2019-03-25 00:00:00","2019-03-25 00:00:00","美国",{"$f":"VLOOKUP(A7,Sheet2!A:I,9,)","v":"仪器正在调试"},"是",null,"是",null,"是",null,"是"]
["2017128003","活体叶绿素仪","叶绿素荧光仪","DUAL-PAM/F",50.39,"2017-06-19","农学院","德国WALZ",1,2008118424,"朱建楚","科研",2141721,"农学院 作物生物学创新中心","在用","正常","*","科研专款及基金","2016-12-02 00:00:00","2016-06-01 00:00:00","德国",{"$f":"VLOOKUP(A8,Sheet2!A:I,9,)","v":0},"是",null,"是",null,"是",null,"是"]
["2018030503","其他农林牧渔专用仪器","植物光合测定仪","LI-6800",50.41,"2018-01-18","园艺学院","美国LI-COR公司",1,2017120017,"邢利博","科研","00302","园艺学院 果树科学系","在用","正常","0-1400umol s-、0-50℃","科研专款及基金","2017-09-21 00:00:00","2017-07-08 00:00:00","美国",{"$f":"VLOOKUP(A9,Sheet2!A:I,9,)","v":0},"是",null,"纳入系统未共享",null,"是",null,"是"]
["2015199803","色谱仪","超高效液相色谱","Waters UPLC I-Class",50.73,"2015-10-28","葡萄酒学院","美国沃特斯公司",1,2008118138,"张予林","科研","01205","葡萄酒学院 葡萄酒化学教研室","在用","正常","UPLC","科研专款及基金","2015-09-04 00:00:00","2014-05-18 00:00:00","美国",{"$f":"VLOOKUP(A10,Sheet2!A:I,9,)","v":0},"是",null,"是",null,"是",null,"是"]
["2020371203","生物、医学样品制备设备","强低温植物培养箱","MKF240",50.76,"2020-10-27","旱区作物逆境生物学国家重点实验室","德国BINDER GmbH公司",1,2010120014,"周晓娜","科研",2141612,"旱区作物逆境生物学国家重点实验室","在用","正常","MKF240","科研专款及基金","2018-12-04 00:00:00","2018-12-11 00:00:00","德国",{"$f":"VLOOKUP(A11,Sheet2!A:I,9,)","v":"不纳入科研仪器范畴：辅助设备"},"否","不纳入系统(辅助设备--特殊条件保障设备)","--",null,"否","不纳入科研仪器范畴：辅助设备","否"]
["2020371303","生物、医学样品制备设备","强低温植物培养箱","MKF240",50.76,"2020-10-27","旱区作物逆境生物学国家重点实验室","德国BINDER GmbH公司",1,2010120014,"周晓娜","科研",2141612,"旱区作物逆境生物学国家重点实验室","在用","正常","MKF240","科研专款及基金","2018-12-04 00:00:00","2018-12-11 00:00:00","德国",{"$f":"VLOOKUP(A12,Sheet2!A:I,9,)","v":"不纳入科研仪器范畴：辅助设备"},"否","不纳入系统(辅助设备--特殊条件保障设备)","--",null,"否","不纳入科研仪器范畴：辅助设备","否"]
["2020371403","生物、医学样品制备设备","强低温植物培养箱","MKF240",50.76,"2020-10-27","旱区作物逆境生物学国家重点实验室","德国BINDER GmbH公司",1,2010120014,"周晓娜","科研",2141612,"旱区作物逆境生物学国家重点实验室","在用","正常","MKF240","科研专款及基金","2018-12-04 00:00:00","2018-12-11 00:00:00","德国",{"$f":"VLOOKUP(A13,Sheet2!A:I,9,)","v":"不纳入科研仪器范畴：辅助设备"},"否","不纳入系统(辅助设备--特殊条件保障设备)","--",null,"否","不纳入科研仪器范畴：辅助设备","否"]
["2017063003","显微镜","倒置荧光显微镜","DMI8",50.77,"2017-04-12","生命科学学院","德国徕卡仪器有限公司",1,2008114532,"范宁娟","教学","01308","生命科学学院 生物学教学科研平台（测试中心）","在用","正常","*","教育事业费","2016-12-21 00:00:00","2017-02-14 00:00:00","中国",{"$f":"VLOOKUP(A14,Sheet2!A:I,9,)","v":0},"是",null,"是",null,"是",null,"是"]
["20053849","X线治疗设备","X光机","XG501A",50.9,"2005-11-15","动物医学院","上海医疗器械厂有限公司",1,2008114019,"白涛","教学","00507","动物医学院 动物医院","在用","正常","*","教育事业费","2005-11-01 00:00:00","2005-10-01 00:00:00","中国",{"$f":"VLOOKUP(A15,Sheet2!A:I,9,)","v":"不纳入科研仪器范畴：教学医疗设备"},"否","不纳入系统(兽医院设备)\n","--",null,"否","不纳入科研仪器范畴：教学医疗设备","否"]
["20108220","色谱仪","高效液相色谱仪",1525,50.97,"2010-09-28","园艺学院","美国WATERS公司",1,2008115642,"梁俊","科研","00302","园艺学院 果树科学系","在用","正常","*","科研专款及基金","2010-07-01 00:00:00","2010-07-01 00:00:00","新加坡",{"$f":"VLOOKUP(A16,Sheet2!A:I,9,)","v":0},"是",null,"纳入系统未共享",null,"是","\n","是"]
["2013266403","物理光学仪器","全谱等离子体发生光谱仪","ICAP6300",51.2,"2013-11-08","旱区节水农业研究院","赛默飞世尔科技有限公司",1,2008115252,"雷国材","科研",21006,"科学技术发展研究院 旱区节水研究院","在用","正常","*","基建设备费","2013-10-14 00:00:00","2013-09-26 00:00:00","英国",{"$f":"VLOOKUP(A17,Sheet2!A:I,9,)","v":0},"是",null,"是",null,"是",null,"是"]
["2016092703","其他农林牧渔专用仪器","混合实验仪","Mixolab 2",51.21,"2016-06-08","农学院","法国肖邦公司",1,2008118424,"朱建楚","科研",2141721,"农学院 作物生物学创新中心","在用","正常","*","科研专款及基金","2015-11-30 00:00:00","2015-11-01 00:00:00","法国",{"$f":"VLOOKUP(A18,Sheet2!A:I,9,)","v":0},"是",null,"是",null,"是",null,"是"]
["2017216803","其他农林牧渔专用仪器","植物光合测定仪","LI-6800",51.46,"2017-11-24","机械与电子工程学院","美国KI-COR公司",1,2008117805,"张海辉","科研","00904","机械与电子工程学院 机械工程系","在用","正常","*","科研专款及基金","2017-09-21 00:00:00","2017-07-13 00:00:00","中国",{"$f":"VLOOKUP(A19,Sheet2!A:I,9,)","v":0},"是",null,"是",null,"是",null,"是"]
["2017162303","其他分析仪器","蛋白纯化系统","AKTA PURE",51.59,"2017-09-07","生命科学大型仪器共享平台","GE公司",1,2019120007,"任美娟","科研",2141769,"实验室安全与条件保障处  生命科学大型仪器共享平台","在用","正在单位间变动","*","科研专款及基金","2015-12-22 00:00:00","2015-09-10 00:00:00","瑞典",{"$f":"VLOOKUP(A20,Sheet2!A:I,9,)","v":0},"是",null,"是",null,"是",null,"是"]
{"$rows_left_out":341}
{"sheet":"基表第二版","index":1,"n_rows":349,"n_cols":30,"rows_kept":349,"hidden":true}
["说明：删除了已报减与待报减设备"]
["资产编号","资产分类","资产名称","规格型号","价值（万元）","建账日期","使用部门","生产厂家","套件数","使用人工号","使用人姓名","使用方向","使用管理部门编号","使用管理部门名称（二级）","现状","资产状态","规格","经费来源","购置日期","出厂日期","国别","科技部备注","是否纳入信息系统","不能纳入系统原因","是否提供系统共享","不能提供系统共享原因","是否上报科技部","不上报科技部原因","是否科技部共享","科技部不共享原因"]
["2015015504","其他排灌设备","指针式喷灌机","DYP-8120",50,"2015-03-24","水利与建筑工程学院","维蒙特工业（山东）有限公司",1,2008118418,"朱德兰","科研","00804","水利与建筑工程学院 水利水电工程系","在用","正常","*","科研专款及基金","2015-03-19 00:00:00","2014-10-27 00:00:00","中国",{"$f":"VLOOKUP(A3,Sheet2!A:I,9,)","v":"不纳入科研仪器范畴：辅助设备"},"否","不纳入系统(生产设备)","--",null,"否","不纳入科研仪器范畴：辅助设备","否"]
["2015856004","喷灌机械设备","新型薄壁滴灌带生产线","自制研发",50,"2015-12-08","水土保持研究所","莱芜市银鹰滴灌技术开发中心",1,2008116173,"牛文全","科研","02110","水土保持研究所 国家节水灌溉杨凌工程技术研究中心","在用","正常","*","科研专款及基金","2015-10-11 00:00:00","2015-10-11 00:00:00","中国",{"$f":"VLOOKUP(A4,Sheet2!A:I,9,)","v":"不纳入科研仪器范畴：辅助设备"},"是","不纳入系统(生产设备)","是",null,"否","不纳入科研仪器范畴：辅助设备","否"]
["2019341803","其他分析仪器","酶标仪（多功能微孔板检测仪）","SPARK",50,"2019-11-27","农学院","Tecan Group Ltd.",1,2013110058,"徐淑兔","科研",2141604,"农学院 农学系","在用","正常","SPARK","基建设备费","2019-09-17 00:00:00","2019-06-27 00:00:00","奥地利",{"$f":"VLOOKUP(A5,Sheet2!A:I,9,)","v":0},"是",null,"是",null,"是",null,"是"]
["2015227603","其他分析仪器","多功能酶标仪","SynergyH1",50.05,"2015-11-11","动物科技学院","BioTek公司",1,2008116839,"王立强","教学","0040502","动物科技学院 动物科学实验室","在用","正常","*","教育事业费","2015-05-11 00:00:00","2015-01-10 00:00:00","美国",{"$f":"VLOOKUP(A6,Sheet2!A:I,9,)","v":0},"是",null,"是",null,"是",null,"是"]
["2021049003","物理特性分析仪器及校准仪器","快速粘度分析仪","RVA-Tec Master",50.11,"2021-05-10","食品科学与工程学院","瑞典波通仪器公司",1,2017120020,"马翠翠","教学","0110801","食品科学与工程学院 食品工艺实验室","在用","正常","RVA-Tec Master","教育事业费","2019-12-09 00:00:00","2019-06-27 00:00:00","澳大利亚",{"$f":"VLOOKUP(A7,Sheet2!A:I,9,)","v":{"$error":"#N/A"}},"是",null,"是",null,"是",null,"否","仪器正在调试"]
["2020403303","物理光学仪器","傅里叶变换红外光谱仪","Nicolet is50",50.3,"2020-11-12","水土保持研究所","美国赛默飞世尔科技有限公司",1,2008117329,"徐宣斌","科研","02106","水土保持研究所 黄土高原土壤侵蚀与旱地农业国家重点实验室","在用","正常","Nicolet is","科研专款及基金","2019-03-25 00:00:00","2019-03-25 00:00:00","美国",{"$f":"VLOOKUP(A8,Sheet2!A:I,9,)","v":"仪器正在调试"},"是",null,"是",null,"是",null,"是"]
["2017128003","活体叶绿素仪","叶绿素荧光仪","DUAL-PAM/F",50.39,"2017-06-19","农学院","德国WALZ",1,2008118424,"朱建楚","科研",2141721,"农学院 作物生物学创新中心","在用","正常","*","科研专款及基金","2016-12-02 00:00:00","2016-06-01 00:00:00","德国",{"$f":"VLOOKUP(A9,Sheet2!A:I,9,)","v":0},"是",null,"是",null,"是",null,"是"]
["2018030503","其他农林牧渔专用仪器","植物光合测定仪","LI-6800",50.41,"2018-01-18","园艺学院","美国LI-COR公司",1,2017120017,"邢利博","科研","00302","园艺学院 果树科学系","在用","正常","0-1400umol s-、0-50℃","科研专款及基金","2017-09-21 00:00:00","2017-07-08 00:00:00","美国",{"$f":"VLOOKUP(A10,Sheet2!A:I,9,)","v":0},"是",null,"纳入系统未共享",null,"是",null,"是"]
["2015199803","色谱仪","超高效液相色谱","Waters UPLC I-Class",50.73,"2015-10-28","葡萄酒学院","美国沃特斯公司",1,2008118138,"张予林","科研","01205","葡萄酒学院 葡萄酒化学教研室","在用","正常","UPLC","科研专款及基金","2015-09-04 00:00:00","2014-05-18 00:00:00","美国",{"$f":"VLOOKUP(A11,Sheet2!A:I,9,)","v":0},"是",null,"是",null,"是",null,"是"]
["2020371203","生物、医学样品制备设备","强低温植物培养箱","MKF240",50.76,"2020-10-27","旱区作物逆境生物学国家重点实验室","德国BINDER GmbH公司",1,2010120014,"周晓娜","科研",2141612,"旱区作物逆境生物学国家重点实验室","在用","正常","MKF240","科研专款及基金","2018-12-04 00:00:00","2018-12-11 00:00:00","德国",{"$f":"VLOOKUP(A12,Sheet2!A:I,9,)","v":"不纳入科研仪器范畴：辅助设备"},"否","不纳入系统(辅助设备--特殊条件保障设备)","--",null,"否","不纳入科研仪器范畴：辅助设备","否"]
["2020371303","生物、医学样品制备设备","强低温植物培养箱","MKF240",50.76,"2020-10-27","旱区作物逆境生物学国家重点实验室","德国BINDER GmbH公司",1,2010120014,"周晓娜","科研",2141612,"旱区作物逆境生物学国家重点实验室","在用","正常","MKF240","科研专款及基金","2018-12-04 00:00:00","2018-12-11 00:00:00","德国",{"$f":"VLOOKUP(A13,Sheet2!A:I,9,)","v":"不纳入科研仪器范畴：辅助设备"},"否","不纳入系统(辅助设备--特殊条件保障设备)","--",null,"否","不纳入科研仪器范畴：辅助设备","否"]
["2020371403","生物、医学样品制备设备","强低温植物培养箱","MKF240",50.76,"2020-10-27","旱区作物逆境生物学国家重点实验室","德国BINDER GmbH公司",1,2010120014,"周晓娜","科研",2141612,"旱区作物逆境生物学国家重点实验室","在用","正常","MKF240","科研专款及基金","2018-12-04 00:00:00","2018-12-11 00:00:00","德国",{"$f":"VLOOKUP(A14,Sheet2!A:I,9,)","v":"不纳入科研仪器范畴：辅助设备"},"否","不纳入系统(辅助设备--特殊条件保障设备)","--",null,"否","不纳入科研仪器范畴：辅助设备","否"]
["2017063003","显微镜","倒置荧光显微镜","DMI8",50.77,"2017-04-12","生命科学学院","德国徕卡仪器有限公司",1,2008114532,"范宁娟","教学","01308","生命科学学院 生物学教学科研平台（测试中心）","在用","正常","*","教育事业费","2016-12-21 00:00:00","2017-02-14 00:00:00","中国",{"$f":"VLOOKUP(A15,Sheet2!A:I,9,)","v":0},"是",null,"是",null,"是",null,"是"]
["20053849","X线治疗设备","X光机","XG501A",50.9,"2005-11-15","动物医学院","上海医疗器械厂有限公司",1,2008114019,"白涛","教学","00507","动物医学院 动物医院","在用","正常","*","教育事业费","2005-11-01 00:00:00","2005-10-01 00:00:00","中国",{"$f":"VLOOKUP(A16,Sheet2!A:I,9,)","v":"不纳入科研仪器范畴：教学医疗设备"},"否","不纳入系统(兽医院设备)\n","--",null,"否","不纳入科研仪器范畴：教学医疗设备","否"]
["20108220","色谱仪","高效液相色谱仪",1525,50.97,"2010-09-28","园艺学院","美国WATERS公司",1,2008115642,"梁俊","科研","00302","园艺学院 果树科学系","在用","正常","*","科研专款及基金","2010-07-01 00:00:00","2010-07-01 00:00:00","新加坡",{"$f":"VLOOKUP(A17,Sheet2!A:I,9,)","v":0},"是",null,"纳入系统未共享",null,"是","\n","是"]
["2013266403","物理光学仪器","全谱等离子体发生光谱仪","ICAP6300",51.2,"2013-11-08","旱区节水农业研究院","赛默飞世尔科技有限公司",1,2008115252,"雷国材","科研",21006,"科学技术发展研究院 旱区节水研究院","在用","正常","*","基建设备费","2013-10-14 00:00:00","2013-09-26 00:00:00","英国",{"$f":"VLOOKUP(A18,Sheet2!A:I,9,)","v":0},"是",null,"是",null,"是",null,"是"]
["2016092703","其他农林牧渔专用仪器","混合实验仪","Mixolab 2",51.21,"2016-06-08","农学院","法国肖邦公司",1,2008118424,"朱建楚","科研",2141721,"农学院 作物生物学创新中心","在用","正常","*","科研专款及基金","2015-11-30 00:00:00","2015-11-01 00:00:00","法国",{"$f":"VLOOKUP(A19,Sheet2!A:I,9,)","v":0},"是",null,"是",null,"是",null,"是"]
["2017216803","其他农林牧渔专用仪器","植物光合测定仪","LI-6800",51.46,"2017-11-24","机械与电子工程学院","美国KI-COR公司",1,2008117805,"张海辉","科研","00904","机械与电子工程学院 机械工程系","在用","正常","*","科研专款及基金","2017-09-21 00:00:00","2017-07-13 00:00:00","中国",{"$f":"VLOOKUP(A20,Sheet2!A:I,9,)","v":0},"是",null,"是",null,"是",null,"是"]
{"$rows_left_out":330}
{"sheet":"基表第三版","index":2,"n_rows":281,"n_cols":16,"rows_kept":281,"hidden":true}
["说明：在基表第二版基础上，删除了“不纳入科研仪器范畴的仪器设备”"]
["资产编号","资产分类","资产名称","规格型号","价值（万元）","建账日期","使用部门","生产厂家","是否纳入信息系统","不能纳入系统原因","是否提供系统共享","不能提供系统共享原因","是否上报科技部","不上报科技部原因","是否科技部共享","科技部不共享原因"]
["2019341803","其他分析仪器","酶标仪（多功能微孔板检测仪）","SPARK",50,"2019-11-27","农学院","Tecan Group Ltd.","是",null,"是",null,"是",null,"是"]
["2015227603","其他分析仪器","多功能酶标仪","SynergyH1",50.05,"2015-11-11","动物科技学院","BioTek公司","是",null,"是",null,"是",null,"是"]
["2021049003","物理特性分析仪器及校准仪器","快速粘度分析仪","RVA-Tec Master",50.11,"2021-05-10","食品科学与工程学院","瑞典波通仪器公司","是",null,"是",null,"是",null,"否","仪器正在调试"]
["2020403303","物理光学仪器","傅里叶变换红外光谱仪","Nicolet is50",50.3,"2020-11-12","水土保持研究所","美国赛默飞世尔科技有限公司","是",null,"是",null,"是",null,"是"]
["2017128003","活体叶绿素仪","叶绿素荧光仪","DUAL-PAM/F",50.39,"2017-06-19","农学院","德国WALZ","是",null,"是",null,"是",null,"是"]
["2018030503","其他农林牧渔专用仪器","植物光合测定仪","LI-6800",50.41,"2018-01-18","园艺学院","美国LI-COR公司","是",null,"纳入系统未共享",null,"是",null,"是"]
["2015199803","色谱仪","超高效液相色谱","Waters UPLC I-Class",50.73,"2015-10-28","葡萄酒学院","美国沃特斯公司","是",null,"是",null,"是",null,"是"]
["2017063003","显微镜","倒置荧光显微镜","DMI8",50.77,"2017-04-12","生命科学学院","德国徕卡仪器有限公司","是",null,"是",null,"是",null,"是"]
["20108220","色谱仪","高效液相色谱仪",1525,50.97,"2010-09-28","园艺学院","美国WATERS公司","是",null,"纳入系统未共享",null,"是","\n","是"]
["2013266403","物理光学仪器","全谱等离子体发生光谱仪","ICAP6300",51.2,"2013-11-08","旱区节水农业研究院","赛默飞世尔科技有限公司","是",null,"是",null,"是",null,"是"]
["2016092703","其他农林牧渔专用仪器","混合实验仪","Mixolab 2",51.21,"2016-06-08","农学院","法国肖邦公司","是",null,"是",null,"是",null,"是"]
["2017216803","其他农林牧渔专用仪器","植物光合测定仪","LI-6800",51.46,"2017-11-24","机械与电子工程学院","美国KI-COR公司","是",null,"是",null,"是",null,"是"]
["2017162303","其他分析仪器","蛋白纯化系统","AKTA PURE",51.59,"2017-09-07","生命科学大型仪器共享平台","GE公司","是",null,"是",null,"是",null,"是"]
["2015075203","通讯、导航测试仪器","射频阻抗材料分析仪","E4991B",51.63,"2015-07-03","食品科学与工程学院","马来西亚","是",null,"是",null,"是",null,"是"]
["2020402503","色谱仪","超灵敏多功能成像仪","Alliance Q9 Advanced",51.71,"2020-11-24","旱区作物逆境生物学国家重点实验室","英国Uvitec limited公司","是",null,"是",null,"是",null,"是"]
["2020402603","色谱仪","超灵敏多功能成像仪","Alliance Q9 Advanced",51.71,"2020-11-24","旱区作物逆境生物学国家重点实验室","英国Uvitec limited公司","是",null,"是",null,"是",null,"是"]
["2012168703","其他分析仪器","蛋白分离纯化系统","Pathfinder80",51.79,"2012-11-29","动物科技学院","美国伯乐公司","是",null,"是",null,"是",null,"是"]
["2012098903","实验室电工仪器及指针式电表","电子舌","ASTREE",51.82,"2012-06-06","食品科学与工程学院","ALPHAMOS公司","是",null,"是",null,"是",null,"是"]
{"$rows_left_out":262}
{"sheet":"2021年度大型仪器设备开放共享评价考核统计表","index":3,"n_rows":249,"n_cols":13,"rows_kept":249,"merged":[[0,0,0,12],[1,0,1,12],[2,0,2,12]]}
["2021年度大型仪器设备开放共享评价考核统计表\n（数据统计时间范围：2021年1月1日—2021年12月31日）      "]
["单位盖章：               单位领导签字：               填报人：               填报日期：    年   月   日"]
["填表说明：\n1.年有效运行机时：是指仪器设备必要的开机时间+测试时间+必要的后处理时间，不包括空载时间和待机时间（不能超过大仪系统记录机时）。\n2.本表信息来源于“大型仪器设备开放共享信息系统”，相关单位只填报本单位涉及的仪器设备，填报时可根据具体情况修正。"]
["单位名称","仪器编号","仪器名称","价值\n（万元）","建账日期","平台名称","平台属性","是否纳入学校大仪系统","是否通过学校大仪系统提供预约","设备2021年有效运行机时（小时）","其中：对校外服务机时（小时）","大仪系统记录是否与纸质记录相符","备注"]
["农学院","2019341803","酶标仪",50,"2019-11-27","农业农村部西北旱区玉米生物学与遗传育种重点实验室","专业平台","是"]
["农学院","2017128003","叶绿素荧光仪",50.39,"2017-06-19","作物生物学创新中心","院级公共平台","是"]
["农学院","2016092703","混合实验仪",51.21,"2016-06-08","作物生物学创新中心","院级公共平台","是"]
["农学院","2020003703","地物光谱仪",55.46,"2020-05-06","农业农村部西北旱区玉米生物学与遗传育种重点实验室","专业平台","是"]
["农学院","2011312702","毛细管电泳仪",56.03,"2011-11-23",null,null,"是"]
["农学院","2013170603","全自动凯氏定氮仪",58.95,"2013-10-21","农业农村部西北黄土高原作物生理生态与耕作重点实验室","专业平台","是"]
["农学院","2020237903","高效液相色谱仪",59.89,"2020-06-23","农业农村部西北旱区玉米生物学与遗传育种重点实验室","专业平台","是"]
["农学院","2016310803","超高效液相色谱仪",59.96,"2016-12-01","农业农村部西北黄土高原作物生理生态与耕作重点实验室","专业平台","是"]
["农学院","2016241803","毛细管电泳系统",61.38,"2016-11-10","作物生物学创新中心","院级公共平台","是"]
["农学院","2020338103","自动荧光显微镜",62.29,"2020-08-26",null,null,"是"]
["农学院","2020339103","全自动微型电子粉质仪",62.36,"2020-08-26",null,null,"是"]
["农学院","2016041303","实时定量PCR仪",62.55,"2016-04-19","作物生物学创新中心","院级公共平台","是"]
["农学院","2020007403","台式扫描电镜",62.83,"2020-05-06","农业农村部西北旱区玉米生物学与遗传育种重点实验室","专业平台","是"]
["农学院","2020001707","分析型流式细胞仪",64,"2020-05-06","农业农村部西北旱区玉米生物学与遗传育种重点实验室","专业平台","是"]
["农学院","2019157703","玉米单倍体核磁共振分选系统",64.5,"2019-12-30","农业农村部西北旱区玉米生物学与遗传育种重点实验室","专业平台","是"]
["农学院","2020073003","实时定量PCR",65.95,"2020-04-10","农业农村部西北旱区玉米生物学与遗传育种重点实验室","专业平台","是"]
{"$rows_left_out":230}
{"sheet":"Worksheet","index":4,"n_rows":799,"n_cols":11,"rows_kept":799}
["仪器名称","仪器编号","仪器价格","负责人","开放预约模式","开放预约说明","控制方式","存放地点","联系人","单位名称","平台名称"]
["超微量分光光度计","2019280003","¥99,000.00","王雪","未提供预约方式",null,"电源控制","北校区食品科学楼, C306","王雪"," 食品科学与工程学院"]
["高速分选型流式细胞仪","2017163103","¥2,663,375.00","周敏, 刘晓瑞","使用预约",null,"电源控制","北校区老昆虫博物馆一楼   生命科学大型仪器共享平台, ","周敏, 刘晓瑞"," 生命科学大型仪器共享平台（校级）"]
["差示扫描量热仪","2012052003","¥308,200.00","袁阳阳, 技术支持","使用预约","是","电脑登录","南校农科楼园艺学院307, ","袁阳阳"," 园艺学院"," 园艺科学研究中心"]
["差示扫描量热仪","2016059103","¥323,850.00","崔璐","使用预约",null,"电脑登录","北校区食品科学楼, C315","崔璐"," 食品科学与工程学院"," 食品学院教学科研平台"]
["场发射扫描电子显微镜","2017162903","¥1,942,525.00","黄克让, 李佳洲, 王珍","使用预约","全面开放","电脑登录","北校区老昆虫博物馆一楼, 生命科学大型仪器共享平台","黄克让, 王珍"," 生命科学大型仪器共享平台（校级）"]
["超高分辨率激光共聚焦显微镜","2020368803","¥3,500,000.00","赵华, 袁凤平","送样预约","请点击链接https://csbaa.nwsuaf.edu.cn/sypt/xwzx/index.htm\n阅读“预约使用指南”完成注册，经培训后可预约使用","电脑登录","南校区科研楼1305, ","赵华, 袁凤平"," 旱区作物逆境生物学国家重点实验室"," 旱区作物逆境生物学国家重点实验室实验平台"]
["超高效液相色谱","2016307603","¥558,085.00","技术支持, 赵静","使用预约",null,"电脑登录","农科楼园艺学院304, ","赵静"," 园艺学院"," 园艺科学研究中心"]
["超高效液相色谱","2015199803","¥507,292.50","张予林","使用预约和送样预约","开放 至少提前3天预约","电脑登录","葡萄酒学院308西, ","张予林"," 葡萄酒学院"," 葡萄与葡萄酒工程研究平台"]
["蛋白纯化系统","2012098803","¥536,900.00","周元","使用预约",null,"电脑登录","北校区食品科学楼, C321","周元"," 食品科学与工程学院"," 食品学院教学科研平台"]
["等温滴定量热仪","2017163303","¥536,000.00","李璐琦, 任美娟, 刘耀","使用预约",null,"电脑登录","北校区老昆虫博物馆一楼, 生命科学大型仪器共享平台","李璐琦, 任美娟, 刘耀"," 生命科学大型仪器共享平台（校级）"]
["等温滴定微量热仪","2020402403","¥795,900.00","周晓娜, 张琼","送样预约","重点实验室微信系统预约\nhttps://csbaa.nwsuaf.edu.cn/sypt/dbzyj/index.htm\n阅读“预约使用指南”完成注册，经培训后可预约使用","电脑登录","科研楼1207, ","周晓娜, 张琼"," 旱区作物逆境生物学国家重点实验室"," 旱区作物逆境生物学国家重点实验室实验平台"]
["电子鼻","2012099003","¥538,600.00","胡亚云","使用预约",null,"电脑登录","北校区食品科学楼, C303","胡亚云"," 食品科学与工程学院"," 食品学院教学科研平台"]
["电子舌","2012098903","¥511,652.00","胡亚云","使用预约",null,"电脑登录","北校区食品科学楼, C303","胡亚云"," 食品科学与工程学院"," 食品学院教学科研平台"]
["动物代谢分析仪","2020200303","¥590,000.00","刘晓丽","使用预约",null,"电脑登录","北校区食品科学楼, C310","刘晓丽"," 食品科学与工程学院"," 食品学院教学科研平台"]
["多功能酶标仪","2018274703","¥357,500.00","李艳, 马珍珍, 陈娟, 技术支持","使用预约",null,"电脑登录","西北农林南校区农科大楼植保学院113室, ","李艳, 马珍珍"," 植物保护学院"," 植物保护科技创新平台"]
["多功能酶标仪","2015227603","¥500,500.00","王立强, 赵丽丽, 赵璠","使用预约和送样预约","上班时间预约","电脑登录","西北农林科技大学北校区动科楼453, ","王立强, 赵丽丽, 赵璠"," 动物科技学院"]
["多光谱动态荧光显微成像系统（植物活体成像仪）","2020456103","¥1,490,000.00","袁凤平","送样预约","请登录https://csbaa.nwsuaf.edu.cn/sypt/index.htm 查看预约，第一次使用请在工作时段联系管理员进行讲解培训","电脑登录","西北农林科技大学南校区科研楼1210室, ","袁凤平"," 旱区作物逆境生物学国家重点实验室"," 旱区作物逆境生物学国家重点实验室实验平台"]
["傅里叶变换红外光谱仪","2017058003","¥246,725.00","张玲玲","使用预约",null,"电脑登录","南校区林学院实验楼, 440","张玲玲"," 林学院"," 林学院科研实验中心"]
["高分辨离子淌度液质联用仪","2017163203","¥3,639,350.00","李璐琦, 任美娟, 技术支持, 刘耀","送样预约",null,"电脑登录","北校区老昆虫博物馆一楼, 生命科学大型仪器共享平台","李璐琦, 任美娟, 刘耀"," 生命科学大型仪器共享平台（校级）"]
{"$rows_left_out":780}
{"sheet":"Worksheet (2)","index":5,"n_rows":31,"n_cols":3,"rows_kept":31,"hidden":true,"merged":[[0,0,0,2]]}
["大仪系统各平台信息"]
["单位名称","平台名称","平台属性"]
["农学院","农业农村部西北地区小麦生物学与遗传育种重点实验室","专业平台"]
["农学院","作物生物学创新中心","院级公共平台"]
["农学院","农业农村部西北黄土高原作物生理生态与耕作重点实验室","专业平台"]
["农学院","陕西小麦工程技术研究中心","专业平台"]
["农学院","农业农村部西北旱区玉米生物学与遗传育种重点实验室","专业平台"]
["植物保护学院","植物保护科技创新平台","院级公共平台"]
["园艺学院","园艺科学研究中心","院级公共平台"]
["动物科技学院"]
["动物医学院"]
["林学院","林学院科研实验中心","院级公共平台"]
["资源环境学院","资源环境学院土肥所","专业平台"]
["资源环境学院","资源与环境科学研究实验中心","专业平台"]
["资源环境学院","旱地土壤培肥与高效施肥科研团队","专业平台"]
["水利与建筑工程学院","水利与建筑工程学院大型仪器共享平台","院级公共平台"]
["机械与电子工程学院","农业农村部农村可再生能源开发利用西部科学观测实验站","专业平台"]
["机械与电子工程学院","机电学院教学中心共享平台","院级公共平台"]
["机械与电子工程学院","农业农村部农业物联网重点实验室共享平台","专业平台"]
["机械与电子工程学院","农业农村部北方农业装备科学观测实验站","专业平台"]
{"$rows_left_out":12}
{"sheet":"Sheet2","index":6,"n_rows":327,"n_cols":9,"rows_kept":327,"hidden":true}
["资产编号","资产分类","资产名称","规格型号","价值(万元)","建账日期","使用部门","生产厂家","备注"]
["2011121401","显微镜","倒置荧光显微镜及活细胞工作站","DMI6000B+AF6000型",115.76,"2011-03-02","动物医学院","徕卡仪器有限公司"]
["20102483","其他电工仪器仪表","显微操作仪","IX71PH+DP25",54.57,"2010-09-27","动物医学院","OLYMPUS公司"]
["20097847","电化学分析仪器","毛细管电泳仪","P/ACE MDQ",64.08,"2009-09-18","化学与药学院","贝克曼库尔特公司"]
["20098975","其他农作物及林特产品收获机械","小区收割机","CLASSIC",157.62,"2009-11-03","农学院","WINTERSTEIGER公司","不纳入科研仪器范畴：辅助设备"]
["20099598","其他分析仪器","测序仪",3730,214.5,"2009-11-30","农学院","AB公司","老旧仪器，技术性能落后"]
["20099789","物理光学仪器","原子吸收分光光度计","ICE3500",53.63,"2009-12-11","水土保持研究所","THERMO公司"]
["20099980","技术侦查设备","微生物鉴定仪","BLG808",52.56,"2009-12-14","资源环境学院","BIOLOG公司"]
["2016115603","色谱仪","蛋白质层析系统","AKTAPURE25M2",82.5,"2016-10-19","旱区作物逆境生物学国家重点实验室","美国GE公司"]
["2018143003","波谱仪","核磁共振波谱仪","PlusarTM",58.42,"2018-11-08","化学与药学院","Oxford公司"]
["2016199203","显微镜","高速转盘式激光共聚焦显微镜","Revolution WD",275.57,"2016-10-25","生命科学学院","英国安道尔科技有限公司"]
["2017037603","物理光学仪器","高精度便携式地物光谱仪","Fieldspec4Hi-Res",74.48,"2017-03-03","水土保持研究所","美国ASD公司"]
["2016107804","其他石油和化学工业专用设备","金属激光烧结成型系统","SLM100",118,"2016-11-07","机械与电子工程学院","中国吴江中瑞机电了解有限公司","不纳入科研仪器范畴：教学医疗设备"]
["2017063003","显微镜","倒置荧光显微镜","DMI8",50.77,"2017-04-12","生命科学学院","德国徕卡仪器有限公司"]
["2018142703","其他分析仪器","乳品分析仪","FT1",74.48,"2018-06-19","动物科技学院","丹麦福斯分析仪器公司"]
["2016089603","其他分析仪器","数字PCR仪","Quantstudio 3D",97.09,"2016-06-08","农学院","Life technologies"]
["2016241803","电化学分析仪器","毛细管电泳系统","P/ACE MDQ",61.38,"2016-11-10","农学院","美国AB Sciex"]
["2017517703","物理光学仪器","激光全站扫描仪","MS50",72.66,"2017-12-22","水土保持研究所","瑞士莱卡公司"]
["2016001707","细胞核组织培养设备","流式细胞仪","FACSAria Special Order Researc",244.72,"2016-06-08","农学院","美国BD公司"]
["2016092703","其他农林牧渔专用仪器","混合实验仪","Mixolab 2",51.21,"2016-06-08","农学院","法国肖邦公司"]
{"$rows_left_out":308}
{"sheet":"Sheet3","index":7,"n_rows":2,"n_cols":1,"rows_kept":2}
["是"]
["否"]